Community Food and Housing, and Emergency and Other Relief Services
type: Class
subclass of: R8sg6ZiCdJPHi2EUyh7BiZf
definition: This industry group comprises establishments primarily engaged in one of the following: (1) collecting, preparing, and delivering food for the needy; (2) providing short-term emergency shelter, temporary residential shelter, transitional housing, volunteer construction or repair of low-cost housing, and/or repair of homes for individuals or families in need; or (3) providing food, shelter, clothing, medical relief, resettlement, and counseling to victims of domestic or international disasters or conflicts (e.g., wars).