All Other Miscellaneous Manufacturing
type: Class
subclass of: 8Qo4 vlCTraQTxZhVQMm8Q
definition: This U.S. industry comprises establishments primarily engaged in miscellaneous manufacturing (except medical equipment and supplies, jewelry and silverware, sporting and athletic goods, dolls, toys, games, office supplies, signs, gaskets, packing, and sealing devices, musical instruments, fasteners, buttons, needles, pins, brooms, brushes, mops, and burial caskets).
example: Artificial Christmas trees manufacturing
example: Candles manufacturing
example: Christmas tree ornaments (except glass and electric) manufacturing
example: Cigarette lighters (except precious metal) manufacturing
example: Coin- or card-operated amusement machines (except jukebox) manufacturing
example: Electronic cigarettes manufacturing
example: Hairpieces (e.g., wigs, toupees, wiglets) manufacturing
example: Portable fire extinguishers manufacturing
example: Potpourri manufacturing
example: Tobacco pipes manufacturing
example: Umbrellas manufacturing