Other Services Related to Advertising
type: Class
subclass of: qHYffSF4Ska3pfGxp qnmA
definition: This industry comprises establishments primarily engaged in providing advertising services (except advertising agency services, public relations agency services, media buying agency services, media representative services, display advertising services, direct mail advertising services, advertising material distribution services, and marketing consulting services).
example: Advertising specialties (e.g., keychains, magnets, pens) distribution services (except direct mail)
example: Display lettering services
example: Mannequin decorating services
example: Merchandise demonstration services
example: Sign lettering and painting services
example: Store window dressing or trimming services
example: Welcoming services (i.e., advertising services)