Industrial Truck, Tractor, Trailer, and Stacker Machinery Manufacturing
type: Class
subclass of: HNVzadjSQGur0qgpX0Smbw
definition: This U.S. industry comprises establishments primarily engaged in manufacturing industrial trucks, tractors, trailers, and stackers (i.e., truck-type) such as forklifts, pallet loaders and unloaders, and portable loading docks.