All Other Travel Arrangement and Reservation Services
type: Class
subclass of: aVATO1h8Q7yGC9sLbSm7jw
definition: This U.S. industry comprises establishments (except travel agencies, tour operators, and convention and visitors bureaus) primarily engaged in providing travel arrangement and reservation services.
example: Condominium time-share exchange services
example: Reservation (e.g., airline, car rental, hotel, restaurant) services
example: Road and travel services automobile clubs
example: Ticket (e.g., airline, bus, cruise ship, sports, theatrical) offices
example: Ticket (e.g., amusement, sports, theatrical) agencies