Iron Foundries
type: Class
subclass of: 5 bs3MXKTrCIt5UR6Gy VA
definition: This U.S. industry comprises establishments primarily engaged in pouring molten pig iron or iron alloys into molds to manufacture castings (e.g., cast iron manhole covers, cast iron pipe, cast iron skillets). Establishments in this industry purchase iron made in other establishments.