All Other Publishers
type: Class
subclass of: qf3aLRCaRsKFAA IZ6aO A
definition: This U.S. industry comprises establishments generally known as publishers (except newspaper, magazine, book, directory, mailing list, music, software, and greeting card publishers). These establishments may publish works in print or electronic form, including exclusively on the Internet.
example: Art publishers
example: Calendar publishers