Motor Vehicle Parts Manufacturing
type: Class
subclass of: R8q7pmb15BQ563KmqZxMC3W
definition: This industry group comprises establishments primarily engaged in manufacturing motor vehicle gasoline engines and engine parts, motor vehicle electrical and electronic equipment, motor vehicle steering and suspension components (except springs), motor vehicle brake systems, motor vehicle transmission and power train parts, motor vehicle seating and interior trim, motor vehicle metal stampings, and other motor vehicle parts and accessories. This industry group includes establishments that rebuild motor vehicle parts.