Other Furniture Related Product Manufacturing
type: Class
subclass of: RDQhLz0PnZB43VXzrf46Spa
definition: This industry group comprises establishments manufacturing furniture related products, such as mattresses, blinds, and shades.