Pension Funds
type: Class
subclass of: 2UU3O83LQWOr41rYmPHrdg
definition: This industry comprises legal entities (i.e., funds, plans, and/or programs) organized to provide retirement income benefits exclusively for the sponsor's employees or members.
example: Employee benefit plans
example: Pension funds and plans
example: Retirement plans