Sports Teams and Clubs
type: Class
subclass of: D4AoLnSSTVqX1Cj--YM 3A
definition: This U.S. industry comprises professional or semiprofessional sports teams or clubs primarily engaged in participating in live sporting events, such as baseball, basketball, football, hockey, soccer, and jai alai games, before a paying audience. These establishments may or may not operate their own arena, stadium, or other facility for presenting these events.