Nonmetallic Mineral Product Manufacturing Industry
type: Class
subclass of: RBOjgvcq6Z33XxMhTxWiiDS
definition: The Nonmetallic Mineral Product Manufacturing subsector is based on the transformation of mined or quarried nonmetallic minerals, such as sand, gravel, stone, clay, and refractory materials, into products for intermediate or final consumption. Processes used include grinding, mixing, cutting, shaping, and honing. Heat often is used in the process and chemicals are frequently mixed to change the composition, purity, and chemical properties for the intended product. For example, glass is produced by heating silica sand to the melting point (sometimes combined with cullet or recycled glass) and then drawn, floated, or blow molded to the desired shape or thickness. Refractory materials are heated and then formed into bricks or other shapes for use in industrial applications. The Nonmetallic Mineral Product Manufacturing subsector includes establishments that manufacture bricks, refractories, ceramic products, and glass and glass products, such as plate glass and containers. Also included are cement and concrete products, lime, gypsum, and other nonmetallic mineral products including abrasive products, ceramic plumbing fixtures, statuary, cut stone products, and mineral wool. The products are used in a wide range of activities from construction and heavy and light manufacturing to articles for personal use. Mining, beneficiating, and manufacturing activities often occur in a single location. Separate receipts will be collected for these activities whenever possible. When receipts cannot be broken out between mining and manufacturing, establishments that mine or quarry nonmetallic minerals, beneficiate the nonmetallic minerals, and further process the nonmetallic minerals into a more finished manufactured product are classified based on the primary activity of the establishment. A mine that manufactures a small amount of finished products is classified in Sector 21, Mining, Quarrying, and Oil and Gas Extraction. An establishment that mines whose primary output is a more f…