Armored Car Services
type: Class
subclass of: 2ZkwjIZSR6KbxoNWr3a38w
definition: This U.S. industry comprises establishments primarily engaged in picking up and delivering money, receipts, or other valuable items. These establishments maintain personnel and equipment to protect such properties while in transit.