Wireless Telecommunications Carriers (except Satellite)
type: Class
subclass of: w4DOnajkSfC-XzLtKxtfQg
definition: This U.S. industry comprises establishments primarily engaged in operating and maintaining switching and transmission facilities to provide communications via the airwaves. Establishments in this industry have spectrum licenses and provide services using that spectrum, such as cellular phone services, paging services, wireless Internet access, and wireless video services.
example: Cellular telephone service carriers
example: Paging services, except satellite
example: Wireless Internet service providers, except satellite
example: Wireless telephone communications carriers, except satellite