Nonferrous Metal (except Copper and Aluminum) Rolling, Drawing, Extruding, and Alloying
type: Class
subclass of: 851IJnH0SbCdeOgoqi0vZw
definition: This industry comprises establishments primarily engaged in one or more of the following: (1) recovering nonferrous metals (except copper and aluminum) and nonferrous metal alloys from scrap; (2) alloying purchased nonferrous metals (except copper and aluminum); (3) rolling, drawing, and extruding shapes from purchased nonferrous metals (except copper and aluminum); and (4) recovering nonferrous metals from scrap (except copper and aluminum) and rolling, drawing, or extruding shapes in integrated facilities.