Other Warehousing and Storage
type: Class
subclass of: BnUqwMLdS9-fOFztNfp1qg
definition: This industry comprises establishments primarily engaged in operating warehousing and storage facilities (except general merchandise, refrigerated, and farm product warehousing and storage).
example: Bulk petroleum storage
example: Document storage and warehousing
example: Lumber storage terminals
example: Whiskey warehousing