Paper and Paper Product Merchant Wholesalers
type: Class
subclass of: RB9cei2GHUCqSsSwdI0ySs
definition: This industry group comprises establishments primarily engaged in the merchant wholesale distribution of bulk printing and writing paper; stationery and office supplies; and industrial and personal service paper.