Steel Foundries (except Investment)
type: Class
subclass of: 5 bs3MXKTrCIt5UR6Gy VA
definition: This U.S. industry comprises establishments primarily engaged in manufacturing steel castings (except steel investment castings). Establishments in this industry purchase steel made in other establishments.