Fossil Fuel Electric Power Generation
type: Class
subclass of: SGahJEz Tfqwxxi7eSpqlA
definition: This U.S. industry comprises establishments primarily engaged in operating fossil fuel powered electric power generation facilities. These facilities use fossil fuels, such as coal, oil, or gas, in internal combustion or combustion turbine conventional steam process to produce electric energy. The electric energy produced in these establishments is provided to electric power transmission systems or to electric power distribution systems.