Administration of Public Health Programs
type: Class
subclass of: g-NFBRAIS -JJx1IqArTVg
definition: This industry comprises government establishments primarily engaged in the planning, administration, and coordination of public health programs and services, including environmental health activities, mental health, categorical health programs, health statistics, and immunization services. Government establishments primarily engaged in conducting public health-related inspections are included in this industry.
example: Communicable disease program administration, public administration
example: Coroners' offices, public administration
example: Health program administration, public administration
example: Mental health program administration, public administration
example: Public health program administration, nonoperating, public administration