Special Needs Transportation
type: Class
subclass of: SAo8Dp5qQvWsNsNR-tGZhw
definition: This U.S. industry comprises establishments primarily engaged in providing special needs transportation (except to and from school or work) for the disabled or elderly. These establishments may use specially equipped vehicles to provide passenger transportation.