Short Line Railroads
type: Class
subclass of: Qfg7k82rSDq-ySL8nIBPuQ
definition: This U.S. industry comprises establishments known as short-line railroads primarily engaged in operating railroads for the transport of cargo over a short distance on local rail lines not part of a rail network.