Animal (except Poultry) Slaughtering
type: Class
subclass of: i22tsqU-R5SH9nDskUhX8Q
definition: This U.S. industry comprises establishments primarily engaged in slaughtering animals (except poultry and small game). Establishments that slaughter and prepare meats are included in this industry.