Service Establishment Equipment and Supplies Merchant Wholesalers
type: Class
subclass of: 0bwbqpSMSGGJlyYAfFjSlA
definition: This industry comprises establishments primarily engaged in the merchant wholesale distribution of specialized equipment and supplies of the type used by service establishments (except specialized equipment and supplies used in offices, stores, hotels, restaurants, schools, health and medical facilities, photographic facilities, and specialized equipment used in transportation and construction activities).
example: Amusement park equipment merchant wholesalers
example: Beauty parlor equipment and supplies merchant wholesalers
example: Car wash equipment and supplies merchant wholesalers
example: Drycleaning equipment and supplies merchant wholesalers
example: Janitorial equipment and supplies merchant wholesalers
example: Undertakers' equipment and supplies merchant wholesalers
example: Upholsterers' equipment and supplies (except fabrics) merchant wholesalers
example: Voting machines merchant wholesalers
example: Water treatment equipment, municipal, merchant wholesalers