Ornamental and Architectural Metal Work Manufacturing
type: Class
subclass of: hs26gUWmSpan-dGyuzrHag
definition: This U.S. industry comprises establishments primarily engaged in manufacturing ornamental and architectural metal work, such as staircases, metal open steel flooring, fire escapes, railings, and scaffolding.