All Other Miscellaneous Retailers
type: Class
subclass of: 2Oxye5SjQYyEy3BmoxJcfQ
definition: Trophy (e.g., awards and plaques) retailers
example: Art supply retailers
example: Candle retailers
example: Cemetery memorial (e.g., headstones, markers, vaults) dealers
example: Collectors' items (e.g., autograph, coin, card, stamp) retailers (except used rare items)
example: Fireworks retailers
example: Flower retailers, artificial or dried
example: Home security equipment retailers
example: Hot tub retailers
example: Swimming pool (above-ground) and supply retailers