Other Support Activities for Transportation
type: Class
subclass of: lxlbuPNIQtelrvktdO9dxA
definition: This industry comprises establishments primarily engaged in providing support activities to transportation (except for air transportation; rail transportation; water transportation; road transportation; and freight transportation arrangement).
example: Arrangement of vanpools or car pools (except ridesharing arrangement services)
example: Independent pipeline terminal facilities
example: Stockyards (i.e., not for fattening or selling livestock)