Broom, Brush, and Mop Manufacturing
type: Class
subclass of: 8Qo4 vlCTraQTxZhVQMm8Q
definition: This U.S. industry comprises establishments primarily engaged in manufacturing brooms, mops, and brushes.