Zoos and Botanical Gardens
type: Class
subclass of: xsAUmUzRRpSxsvlEJAaOLA
definition: This industry comprises establishments primarily engaged in the preservation and exhibition of live plant and animal life displays.
example: Aquariums
example: Arboreta
example: Aviaries
example: Wild animal parks
example: Zoological gardens