Sewage Treatment Facilities
type: Class
subclass of: IMG5GjCWTgeRGbpJARBXcQ
definition: This industry comprises establishments primarily engaged in operating sewer systems or sewage treatment facilities that collect, treat, and dispose of waste.