Guided Missile and Space Vehicle Propulsion Unit and Propulsion Unit Parts Manufacturing
type: Class
subclass of: OHRgpwVGRR2OOs9XZgkEgA
definition: This U.S. industry comprises establishments primarily engaged in (1) manufacturing guided missile and/or space vehicle propulsion units and propulsion unit parts and/or (2) developing and making prototypes of guided missile and space vehicle propulsion units and propulsion unit parts.