Custom Architectural Woodwork and Millwork Manufacturing
type: Class
subclass of: iCBE0YiVTYmtAjluJBMIUQ
definition: This U.S. industry comprises establishments primarily engaged in manufacturing custom designed interiors consisting of architectural woodwork and fixtures utilizing wood, wood products, and plastics laminates. All of the industry output is made to individual order on a job shop basis and requires skilled craftsmen as a labor input. A job might include custom manufacturing of display fixtures, gondolas, wall shelving units, entrance and window architectural detail, sales and reception counters, wall paneling, and matching furniture.