Motion Picture and Video Exhibition
type: Class
subclass of: UlA02PR-R3man 0KO n-2w
definition: This industry comprises establishments primarily engaged in operating motion picture theaters and/or exhibiting motion pictures or videos at film festivals, and so forth.