Other Paperboard Container Manufacturing
type: Class
subclass of: XmPn9qdqRNCrNlvwItWVMw
definition: This U.S. industry comprises establishments primarily engaged in converting paperboard into paperboard containers (except corrugated, solid fiber, and folding paperboard boxes) without manufacturing paperboard.
example: Fiber cans and drums (i.e., all-fiber, nonfiber ends of any material) made from purchased paperboard
example: Milk cartons made from purchased paper or paperboard
example: Sanitary food containers (except folding) made from purchased paper or paperboard
example: Setup (i.e., not shipped flat) boxes made from purchased paperboard