Landscaping Services
type: Class
subclass of: qQMZ 3o0R2K eZJ9FBlF7Q
definition: This industry comprises (1) establishments primarily engaged in providing landscape care and maintenance services and/or installing trees, shrubs, plants, lawns, or gardens and (2) establishments primarily engaged in providing these services along with the design of landscape plans and/or the construction (i.e., installation) of walkways, retaining walls, decks, fences, ponds, and similar structures.