Cut and Sew Apparel Contractors
type: Class
subclass of: slCGTa9WSkGsv2cuoj4eKg
definition: This industry comprises establishments commonly referred to as contractors primarily engaged in (1) cutting materials owned by others for apparel and accessories and/or (2) sewing materials owned by others for apparel and accessories.