Other Scientific and Technical Consulting Services
type: Class
subclass of: O-vt7yS3S3C8qVjTbZLXHw
definition: This industry comprises establishments primarily engaged in providing advice and assistance to businesses and other organizations on scientific and technical issues (except environmental).
example: Agricultural consulting services
example: Biological consulting services
example: Chemical consulting services
example: Economic consulting services
example: Energy consulting services
example: Motion picture consulting services
example: Physics consulting services
example: Radio consulting services
example: Safety consulting services
example: Security consulting services