Biomass Electric Power Generation
type: Class
subclass of: SGahJEz Tfqwxxi7eSpqlA
definition: This U.S. industry comprises establishments primarily engaged in operating biomass electric power generation facilities. These facilities use biomass (e.g., wood, waste, alcohol fuels) to produce electric energy. The electric energy produced in these establishments is provided to electric power transmission systems or to electric power distribution systems.