Other Leather and Allied Product Manufacturing
type: Class
subclass of: 6UdWAYVST5a7hdvg2sNRMw
definition: This industry comprises establishments primarily engaged in manufacturing leather products (except footwear and apparel) from purchased leather or leather substitutes (e.g., fabric, plastics).
example: Billfolds, all materials, manufacturing
example: Boot and shoe cut stock and findings, leather, manufacturing
example: Dog furnishings (e.g., collars, harnesses, leashes, muzzles), manufacturing
example: Luggage, all materials, manufacturing
example: Purses, women's, all materials (except metal), manufacturing
example: Shoe soles, leather, manufacturing
example: Toilet kits and cases (except metal) manufacturing
example: Watch bands (except metal) manufacturing
example: Welders' jackets, leggings, and sleeves, leather, manufacturing