Vocational Rehabilitation Services
type: Class
subclass of: JYwsG2GBTKKgKnPalOVRgQ
definition: This industry comprises (1) establishments primarily engaged in providing vocational rehabilitation or habilitation services, such as job counseling, job training, and work experience, to unemployed and underemployed persons, persons with disabilities, and persons who have a job market disadvantage because of lack of education, job skill, or experience and (2) establishments primarily engaged in providing training and employment to persons with disabilities. Vocational rehabilitation job training facilities (except schools) and sheltered workshops (i.e., work experience centers) are included in this industry.