Business Service Centers
type: Class
subclass of: nTlbbVGtQ6qs5CqcwYnhcg
definition: This industry comprises (1) establishments primarily engaged in providing mailbox rental and other postal and mailing services (except direct mail advertising); (2) establishments, generally known as copy centers or shops, primarily engaged in providing photocopying, duplicating, blueprinting, and other document copying services without also providing printing services (i.e., offset printing, quick printing, digital printing, prepress services); and (3) establishments that provide a range of office support services (except printing services), such as mailing services, document copying services, facsimile services, word processing services, on-site PC rental services, and office product sales.