Motor Vehicle Manufacturing
type: Class
subclass of: R8q7pmb15BQ563KmqZxMC3W
definition: This industry group comprises establishments primarily engaged in (1) manufacturing complete automobiles, light duty motor vehicles, and heavy duty trucks (i.e., body and chassis or unibody) or (2) manufacturing motor vehicle chassis only.