Court Reporting and Stenotype Services
type: Class
subclass of: yhsp 9s9QNm9UB4VUccNug
definition: This U.S. industry comprises establishments primarily engaged in providing verbatim reporting and stenotype recording of live legal proceedings and transcribing subsequent recorded materials.
example: Court reporting or stenotype recording services
example: Public stenography services
example: Real-time (i.e., simultaneous) closed captioning of live television performances, meetings, conferences