Flight Training
type: Class
subclass of: D77ATOEvSPqaboc361FuwQ
definition: This U.S. industry comprises establishments primarily engaged in offering aviation and flight training. These establishments may offer vocational training, recreational training, or both.