Other General Government Support
type: Class
subclass of: 3G5UeK7AQYCylMGi4vdq-A
definition: This industry comprises government establishments primarily engaged in providing general support for government. Such support services include personnel services, election boards, and other general government support establishments that are not classified elsewhere in public administration.
example: Civil rights commissions
example: Civil service commissions
example: General services departments, government
example: Personnel offices, government
example: Supply agencies, government