Rooming and Boarding Houses, Dormitories, and Workers' Camps
type: Class
subclass of: DfrhxkwnTgawhd8MXR9LfA
definition: This industry comprises establishments primarily engaged in operating rooming and boarding houses and similar facilities, such as fraternity houses, sorority houses, off campus dormitories, residential clubs, and workers' camps. These establishments provide temporary or longer-term accommodations, which, for the period of occupancy, may serve as a principal residence. These establishments also may provide complementary services, such as housekeeping, meals, and laundry services.
example: Dormitories (off campus)
example: Fraternity houses
example: Rooming houses
example: Sorority houses
example: Workers' camps