Other Measuring and Controlling Device Manufacturing
type: Class
subclass of: NwpC-AVOSrGS91q0HJPhaw
definition: This U.S. industry comprises establishments primarily engaged in manufacturing measuring and controlling devices (except search, detection, navigation, guidance, aeronautical, and nautical instruments and systems; automatic environmental controls for residential, commercial, and appliance use; instruments for measurement, display, and control of industrial process variables; totalizing fluid meters and counting devices; instruments for measuring and testing electricity and electrical signals; analytical laboratory instruments; irradiation equipment; and electromedical and electrotherapeutic apparatus).
example: Aircraft engine instruments manufacturing
example: Automotive emissions testing equipment manufacturing
example: Clocks assembling
example: Meteorological instruments manufacturing
example: Physical properties testing and inspection equipment manufacturing
example: Polygraph machines manufacturing
example: Radiation detection and monitoring instruments manufacturing
example: Surveying instruments manufacturing
example: Thermometers, liquid-in-glass and bimetal types (except medical), manufacturing
example: Watches (except smartwatches) and parts (except crystals) manufacturing