Nonferrous Metal (except Aluminum) Production and Processing
type: Class
subclass of: R9GqgpAu9J8iXUREZ3M7wzO
definition: This industry group comprises establishments primarily engaged in nonferrous metal (except aluminum) smelting, refining, rolling, drawing, extruding, and alloying.