Plastics Packaging Film and Sheet (including Laminated) Manufacturing
type: Class
subclass of: cW-wZtcFTXuDlNYs96bTZA
definition: This U.S. industry comprises establishments primarily engaged in converting plastics resins into plastics packaging (flexible) film and packaging sheet.