Footwear Merchant Wholesalers
type: Class
subclass of: ffMo7t3PQqS4XIudOoJj0w
definition: This industry comprises establishments primarily engaged in the merchant wholesale distribution of footwear of leather, rubber, and other materials, including athletic footwear (except specialty athletic footwear).